perl problem
3 отговора
103 прегледа
perl problem
Opitwam se da instaliram edin modul na perl s CPAN sys slednata komanda
perl -MCPAN -e 'install Net::Pcap' , no pri testa mi dawa gresha. Kak da razbera kyde e greshkata. Eto i chast ot ekrana:
-----------------------------------------------------
Manifying blib/man3/Net::Pcap.3
/usr/bin/make -- OK
Running make test
PERL_DL_NONLAZY=1 /usr/bin/perl -Iblib/arch -Iblib/lib -I/usr/lib/perl5/i386-linux -I/usr/lib/perl5 -e 'use Test::Harness qw(&runtests $verbose); $verbose=0; runtests @ARGV;' t/*.t
t/01-module......ok
t/02-lookup......ok
t/03-openlive....ok
t/04-loop........ok
t/05-dump........ok
t/06-offline.....ok
t/07-stats.......FAILED test 1
Failed 1/1 tests, 0.00% okay
t/08-filter......ok
t/09-error.......ok
t/10-fileno......ok
t/11-misc........ok
t/12-next........ok
t/13-dispatch....ok
Failed Test Stat Wstat Total Fail Failed List of Failed
-------------------------------------------------------------------------------
t/07-stats.t 1 1 100.00% 1
Failed 1/13 test scripts, 92.31% okay. 1/24 subtests failed, 95.83% okay.
make: *** [test_dynamic] Error 11
/usr/bin/make test -- NOT OK
Running make install
make test had returned bad status, won't install without force
----------------------------
Daite ideq kakwo da prawq?
perl -MCPAN -e 'install Net::Pcap' , no pri testa mi dawa gresha. Kak da razbera kyde e greshkata. Eto i chast ot ekrana:
-----------------------------------------------------
Manifying blib/man3/Net::Pcap.3
/usr/bin/make -- OK
Running make test
PERL_DL_NONLAZY=1 /usr/bin/perl -Iblib/arch -Iblib/lib -I/usr/lib/perl5/i386-linux -I/usr/lib/perl5 -e 'use Test::Harness qw(&runtests $verbose); $verbose=0; runtests @ARGV;' t/*.t
t/01-module......ok
t/02-lookup......ok
t/03-openlive....ok
t/04-loop........ok
t/05-dump........ok
t/06-offline.....ok
t/07-stats.......FAILED test 1
Failed 1/1 tests, 0.00% okay
t/08-filter......ok
t/09-error.......ok
t/10-fileno......ok
t/11-misc........ok
t/12-next........ok
t/13-dispatch....ok
Failed Test Stat Wstat Total Fail Failed List of Failed
-------------------------------------------------------------------------------
t/07-stats.t 1 1 100.00% 1
Failed 1/13 test scripts, 92.31% okay. 1/24 subtests failed, 95.83% okay.
make: *** [test_dynamic] Error 11
/usr/bin/make test -- NOT OK
Running make install
make test had returned bad status, won't install without force
----------------------------
Daite ideq kakwo da prawq?
Re: perl problem
Сигурен ли си, че покриваш изискванията за инсталация на модула (имам предвид дали този stats клас, който умира може да иска модул в ядрото или друг модул за perl)... Също - каква версия ти е perl-a?
воля, воля... и пак воля...
воля, воля... и пак воля...
Re: perl problem
Ами може и да иска? Но аз как да разбера? В момента прбвам да компилирам наново perl 5.8.0, да видим какво ще стане.
Re: perl problem
Виж тук - може да намериш информация за този модул (предполагал, че си търсил, ама все пак)
[линк]
воля, воля... и пак воля...
[линк]
воля, воля... и пак воля...