Slackware 9.0 - errors
13 отговора
255 прегледа
Slackware 9.0 - errors
sys Slackware 9.0 sym, instaliran na Full Install.
no imam nqkoi problemi s instalirane-to (po-to4no configurirane-to) na nqkoi programi.
pri ./configure --enable-gui na mplayer mi dawa slednata gre6ka :
Checking for GUI ... yes
Error: X11 support required for GUI compilation
pri ./configure na Wine-20030408 :
*** Warning: X development files not found. Wine will be built with$
*** X support, which currently does not work, and would probably no$
*** what you want anyway. You will need to install devel packages of
*** Xlib/Xfree86 at the very least.
*** Note: Your system appears to have the FreeType 2 runtime librar$
*** installed, but 'freetype-config' is not in your PATH. Install t$
*** freetype-devel package (or its equivalent on your distribution)$
*** enable Wine to use TrueType fonts.
probwah s root, s normal user ne stawa. X-sa si mi wyrwi bez problem.
instalirah i x-devel ot /slackware/x na diska na Slackware 9.0, no bez nikakaw rezultat :(
nqkoi ako znae da kaje kak moga da go oprawq towa, za6toto na drugi mashini se instalirat
bez problem tezi programi... sy6to taka kato bqh sys Slackware 8.1 sa6to si gi instalirah bez
problem.
sa6to taka polu4awam i mnogo gre6ki pri compilirane-to na nqkoi programi . poglednete i ako mojete kajete kak da razre6a nqkoi ot tqh.
no imam nqkoi problemi s instalirane-to (po-to4no configurirane-to) na nqkoi programi.
pri ./configure --enable-gui na mplayer mi dawa slednata gre6ka :
Checking for GUI ... yes
Error: X11 support required for GUI compilation
pri ./configure na Wine-20030408 :
*** Warning: X development files not found. Wine will be built with$
*** X support, which currently does not work, and would probably no$
*** what you want anyway. You will need to install devel packages of
*** Xlib/Xfree86 at the very least.
*** Note: Your system appears to have the FreeType 2 runtime librar$
*** installed, but 'freetype-config' is not in your PATH. Install t$
*** freetype-devel package (or its equivalent on your distribution)$
*** enable Wine to use TrueType fonts.
probwah s root, s normal user ne stawa. X-sa si mi wyrwi bez problem.
instalirah i x-devel ot /slackware/x na diska na Slackware 9.0, no bez nikakaw rezultat :(
nqkoi ako znae da kaje kak moga da go oprawq towa, za6toto na drugi mashini se instalirat
bez problem tezi programi... sy6to taka kato bqh sys Slackware 8.1 sa6to si gi instalirah bez
problem.
sa6to taka polu4awam i mnogo gre6ki pri compilirane-to na nqkoi programi . poglednete i ako mojete kajete kak da razre6a nqkoi ot tqh.
arson-0.9.7-kde3
"arson-0.9.7-kde3" :
...
lqt-mt -lpng -lXext -lX11 -lSM -lICE -lpthread -lXrender -lutil -lz /usr/lib/./l ibstdc++.so -lm -lc -lgcc_s -Wl,--rpath -Wl,/opt/kde/lib -Wl,--rpath -Wl,/usr/li b/. -Wl,--rpath -Wl,/opt/kde/lib -Wl,--rpath -Wl,/usr/lib/. -Wl,--rpath -Wl,/usr /lib/qt-3.1.2/lib -Wl,--rpath -Wl,/usr/X11/lib/ -Wl,--rpath -Wl,/usr/lib/qt/lib -Wl,--rpath -Wl,/usr/X11R6/lib
/usr/lib/gcc-lib/i386-slackware-linux/3.2.2/../../../../i386-slackware-linux/bin /ld: cannot find -lXinerama
collect2: ld returned 1 exit status
make[3]: *** [arson] Error 1
make[3]: Leaving directory `/home/spot/arson-0.9.7-kde3/src'
make[2]: *** [all-recursive] Error 1
make[2]: Leaving directory `/home/spot/arson-0.9.7-kde3/src'
make[1]: *** [all-recursive] Error 1
make[1]: Leaving directory `/home/spot/arson-0.9.7-kde3'
make: *** [all] Error 2
...
lqt-mt -lpng -lXext -lX11 -lSM -lICE -lpthread -lXrender -lutil -lz /usr/lib/./l ibstdc++.so -lm -lc -lgcc_s -Wl,--rpath -Wl,/opt/kde/lib -Wl,--rpath -Wl,/usr/li b/. -Wl,--rpath -Wl,/opt/kde/lib -Wl,--rpath -Wl,/usr/lib/. -Wl,--rpath -Wl,/usr /lib/qt-3.1.2/lib -Wl,--rpath -Wl,/usr/X11/lib/ -Wl,--rpath -Wl,/usr/lib/qt/lib -Wl,--rpath -Wl,/usr/X11R6/lib
/usr/lib/gcc-lib/i386-slackware-linux/3.2.2/../../../../i386-slackware-linux/bin /ld: cannot find -lXinerama
collect2: ld returned 1 exit status
make[3]: *** [arson] Error 1
make[3]: Leaving directory `/home/spot/arson-0.9.7-kde3/src'
make[2]: *** [all-recursive] Error 1
make[2]: Leaving directory `/home/spot/arson-0.9.7-kde3/src'
make[1]: *** [all-recursive] Error 1
make[1]: Leaving directory `/home/spot/arson-0.9.7-kde3'
make: *** [all] Error 2
mirvChat
"mirvChat" :
...
In file included from sound.cpp:21:
sound.h:23: namespace `audiere' undeclared
sound.h:53: syntax error before `*' token
sound.h:54: syntax error before `*' token
sound.cpp:23: `AudioDevice' was not declared in this scope
sound.cpp:23: 'RefPtr' is used as a type, but is not defined as a type.
sound.cpp: In constructor `sound::sound()':
sound.cpp:29: `RefPtr' undeclared (first use this function)
sound.cpp:29: (Each undeclared identifier is reported only once for each
function it appears in.)
sound.cpp:29: `AudioDevice' undeclared (first use this function)
sound.cpp:29: `OpenDevice' undeclared (first use this function)
sound.cpp:29: `some_device' undeclared (first use this function)
sound.cpp:30: `device' undeclared (first use this function)
sound.cpp:32: `mesg' undeclared (first use this function)
sound.cpp:32: `OpenSound' undeclared (first use this function)
sound.cpp:36: `chat' undeclared (first use this function)
sound.cpp: In member function `bool sound::playFile(const char*)':
sound.cpp:48: `OutputStream' undeclared (first use this function)
sound.cpp:48: `stream' undeclared (first use this function)
make: *** [mirvChat] Error 1
...
In file included from sound.cpp:21:
sound.h:23: namespace `audiere' undeclared
sound.h:53: syntax error before `*' token
sound.h:54: syntax error before `*' token
sound.cpp:23: `AudioDevice' was not declared in this scope
sound.cpp:23: 'RefPtr' is used as a type, but is not defined as a type.
sound.cpp: In constructor `sound::sound()':
sound.cpp:29: `RefPtr' undeclared (first use this function)
sound.cpp:29: (Each undeclared identifier is reported only once for each
function it appears in.)
sound.cpp:29: `AudioDevice' undeclared (first use this function)
sound.cpp:29: `OpenDevice' undeclared (first use this function)
sound.cpp:29: `some_device' undeclared (first use this function)
sound.cpp:30: `device' undeclared (first use this function)
sound.cpp:32: `mesg' undeclared (first use this function)
sound.cpp:32: `OpenSound' undeclared (first use this function)
sound.cpp:36: `chat' undeclared (first use this function)
sound.cpp: In member function `bool sound::playFile(const char*)':
sound.cpp:48: `OutputStream' undeclared (first use this function)
sound.cpp:48: `stream' undeclared (first use this function)
make: *** [mirvChat] Error 1
gwget-0.5.2
"gwget-0.5.2" :
...
/usr/include/gtk-1.2/gdk/gdkx.h:60: warning: type defaults to `int' in declaration of `gdk_get_client_window'
/usr/include/gtk-1.2/gdk/gdkx.h:60: warning: data definition has no type or storage class
In file included from gwget.c:11:
toolbar.h:10:7: warning: no newline at end of file
/usr/include/gtk-1.2/gdk/gdkprivate.h:282: warning: array `gdk_wm_window_protocols' assumed to have one element
make[2]: *** [gwget.o] Error 1
make[2]: Leaving directory `/home/spot/gwget-0.5.2'
make[1]: *** [all-recursive] Error 1
make[1]: Leaving directory `/home/spot/gwget-0.5.2'
make: *** [all-recursive-am] Error 2
...
/usr/include/gtk-1.2/gdk/gdkx.h:60: warning: type defaults to `int' in declaration of `gdk_get_client_window'
/usr/include/gtk-1.2/gdk/gdkx.h:60: warning: data definition has no type or storage class
In file included from gwget.c:11:
toolbar.h:10:7: warning: no newline at end of file
/usr/include/gtk-1.2/gdk/gdkprivate.h:282: warning: array `gdk_wm_window_protocols' assumed to have one element
make[2]: *** [gwget.o] Error 1
make[2]: Leaving directory `/home/spot/gwget-0.5.2'
make[1]: *** [all-recursive] Error 1
make[1]: Leaving directory `/home/spot/gwget-0.5.2'
make: *** [all-recursive-am] Error 2
xcdroast-0.98alpha13
"xcdroast-0.98alpha13" :
...
/usr/include/gtk-1.2/gdk/gdkprivate.h:281: warning: data definition has no type or storage class
/usr/include/gtk-1.2/gdk/gdkprivate.h:282: parse error before "gdk_wm_window_protocols"
/usr/include/gtk-1.2/gdk/gdkprivate.h:282: warning: type defaults to `int' in declaration of `gdk_wm_window_protocols'
/usr/include/gtk-1.2/gdk/gdkprivate.h:282: warning: data definition has no type or storage class
/usr/include/gtk-1.2/gdk/gdkprivate.h:283: parse error before "gdk_selection_property"
/usr/include/gtk-1.2/gdk/gdkprivate.h:283: warning: type defaults to `int' in declaration of `gdk_selection_property'
/usr/include/gtk-1.2/gdk/gdkprivate.h:283: warning: data definition has no type or storage class
/usr/include/gtk-1.2/gdk/gdkprivate.h:282: warning: array `gdk_wm_window_protocols' assumed to have one element
make[2]: *** [xcdroast-main.o] Error 1
make[2]: Leaving directory `/home/spot/xcdroast-0.98alpha13/src'
make[1]: *** [all-recursive] Error 1
make[1]: Leaving directory `/home/spot/xcdroast-0.98alpha13'
make: *** [all] Error 2
...
/usr/include/gtk-1.2/gdk/gdkprivate.h:281: warning: data definition has no type or storage class
/usr/include/gtk-1.2/gdk/gdkprivate.h:282: parse error before "gdk_wm_window_protocols"
/usr/include/gtk-1.2/gdk/gdkprivate.h:282: warning: type defaults to `int' in declaration of `gdk_wm_window_protocols'
/usr/include/gtk-1.2/gdk/gdkprivate.h:282: warning: data definition has no type or storage class
/usr/include/gtk-1.2/gdk/gdkprivate.h:283: parse error before "gdk_selection_property"
/usr/include/gtk-1.2/gdk/gdkprivate.h:283: warning: type defaults to `int' in declaration of `gdk_selection_property'
/usr/include/gtk-1.2/gdk/gdkprivate.h:283: warning: data definition has no type or storage class
/usr/include/gtk-1.2/gdk/gdkprivate.h:282: warning: array `gdk_wm_window_protocols' assumed to have one element
make[2]: *** [xcdroast-main.o] Error 1
make[2]: Leaving directory `/home/spot/xcdroast-0.98alpha13/src'
make[1]: *** [all-recursive] Error 1
make[1]: Leaving directory `/home/spot/xcdroast-0.98alpha13'
make: *** [all] Error 2
smirc-0.70
"smirc-0.70" :
...
/usr/include/c++/3.2.2/backward/backward_warning.h:32:2: warning: #warning This file includes at least one deprecated or antiquated header. Please consider using one of the 32 headers found in section 17.4.1.2 of the C++ standard. Examples include substituting the <X> header for the <X.h> header for C++ includes, or <sstream> instead of the deprecated header <strstream.h>. To disable this warning use -Wno-deprecated.
In file included from string.C:12:
afx.h: In function `void* operator new(unsigned int, void*)':
afx.h:334: redefinition of `void* operator new(unsigned int, void*)'
/usr/include/c++/3.2.2/new:89: `void* operator new(unsigned int, void*)'
previously defined here
afx.h:334: redefinition of `void* operator new(unsigned int, void*)'
/usr/include/c++/3.2.2/new:89: `void* operator new(unsigned int, void*)'
previously defined here
make[2]: *** [string.o] Error 1
make[2]: Leaving directory `/home/spot/smirc-0.70/afx'
make[1]: *** [all-recursive] Error 1
make[1]: Leaving directory `/home/spot/smirc-0.70'
make: *** [all-recursive-am] Error 2
...
/usr/include/c++/3.2.2/backward/backward_warning.h:32:2: warning: #warning This file includes at least one deprecated or antiquated header. Please consider using one of the 32 headers found in section 17.4.1.2 of the C++ standard. Examples include substituting the <X> header for the <X.h> header for C++ includes, or <sstream> instead of the deprecated header <strstream.h>. To disable this warning use -Wno-deprecated.
In file included from string.C:12:
afx.h: In function `void* operator new(unsigned int, void*)':
afx.h:334: redefinition of `void* operator new(unsigned int, void*)'
/usr/include/c++/3.2.2/new:89: `void* operator new(unsigned int, void*)'
previously defined here
afx.h:334: redefinition of `void* operator new(unsigned int, void*)'
/usr/include/c++/3.2.2/new:89: `void* operator new(unsigned int, void*)'
previously defined here
make[2]: *** [string.o] Error 1
make[2]: Leaving directory `/home/spot/smirc-0.70/afx'
make[1]: *** [all-recursive] Error 1
make[1]: Leaving directory `/home/spot/smirc-0.70'
make: *** [all-recursive-am] Error 2
gnomba-0.6.2
"gnomba-0.6.2" :
...
browser.c:860: warning: assignment makes pointer from integer without a cast
browser.c:862: `GtkSignalFunc' undeclared (first use in this function)
browser.c:862: parse error before "workgroupSelect"
browser.c:864: parse error before "clist_click_column"
browser.c:866: warning: implicit declaration of function `gtk_scrolled_window_ne w'
browser.c:866: `NULL' undeclared (first use in this function)
browser.c:866: warning: assignment makes pointer from integer without a cast
browser.c:867: warning: implicit declaration of function `gtk_container_add'
browser.c:867: warning: implicit declaration of function `GTK_CONTAINER'
browser.c:868: `TRUE' undeclared (first use in this function)
browser.c:869: warning: implicit declaration of function `gtk_scrolled_window_se t_policy'
browser.c:869: warning: implicit declaration of function `GTK_SCROLLED_WINDOW'
browser.c:870: `GTK_POLICY_AUTOMATIC' undeclared (first use in this function)
browser.c:873: parse error before "buttonEvent"
browser.c:878: `frame' undeclared (first use in this function)
/usr/include/sys/stat.h: At top level:
browser.c:712: warning: `workgroupSelect' defined but not used
browser.c:716: warning: `clist_click_column' defined but not used
make[2]: *** [browser.o] Error 1
make[2]: Leaving directory `/home/spot/gnomba-0.6.2/src'
make[1]: *** [all-recursive] Error 1
make[1]: Leaving directory `/home/spot/gnomba-0.6.2'
make: *** [all-recursive-am] Error 2
...
browser.c:860: warning: assignment makes pointer from integer without a cast
browser.c:862: `GtkSignalFunc' undeclared (first use in this function)
browser.c:862: parse error before "workgroupSelect"
browser.c:864: parse error before "clist_click_column"
browser.c:866: warning: implicit declaration of function `gtk_scrolled_window_ne w'
browser.c:866: `NULL' undeclared (first use in this function)
browser.c:866: warning: assignment makes pointer from integer without a cast
browser.c:867: warning: implicit declaration of function `gtk_container_add'
browser.c:867: warning: implicit declaration of function `GTK_CONTAINER'
browser.c:868: `TRUE' undeclared (first use in this function)
browser.c:869: warning: implicit declaration of function `gtk_scrolled_window_se t_policy'
browser.c:869: warning: implicit declaration of function `GTK_SCROLLED_WINDOW'
browser.c:870: `GTK_POLICY_AUTOMATIC' undeclared (first use in this function)
browser.c:873: parse error before "buttonEvent"
browser.c:878: `frame' undeclared (first use in this function)
/usr/include/sys/stat.h: At top level:
browser.c:712: warning: `workgroupSelect' defined but not used
browser.c:716: warning: `clist_click_column' defined but not used
make[2]: *** [browser.o] Error 1
make[2]: Leaving directory `/home/spot/gnomba-0.6.2/src'
make[1]: *** [all-recursive] Error 1
make[1]: Leaving directory `/home/spot/gnomba-0.6.2'
make: *** [all-recursive-am] Error 2
kvirc-3.0.0-beta2
"kvirc-3.0.0-beta2" :
...
/opt/kde/include/netwm.h:536: syntax error before `{' token
/opt/kde/include/netwm.h:545: `Window' was not declared in this scope
/opt/kde/include/netwm.h:545: virtual outside class declaration
/opt/kde/include/netwm.h:545: variable or field `closeWindow' declared void
/opt/kde/include/netwm.h:545: syntax error before `{' token
/opt/kde/include/netwm.h:562: `Window' was not declared in this scope
/opt/kde/include/netwm.h:562: parse error before `,' token
/opt/kde/include/netwm.h:562: virtual outside class declaration
/opt/kde/include/netwm.h:565: parse error before `private'
/opt/kde/include/netwm.h:568: 'Role' is used as a type, but is not defined as a
type.
/opt/kde/include/netwm.h:570: parse error before `protected'
/opt/kde/include/netwm.h:610: type specifier omitted for parameter `Window'
/opt/kde/include/netwm.h:610: parse error before `,' token
/opt/kde/include/netwm.h:714: parse error before `)' token
/opt/kde/include/netwm.h:722: parse error before `)' token
/opt/kde/include/netwm.h:741: type specifier omitted for parameter `Bool'
/opt/kde/include/netwm.h:741: parse error before `=' token
/opt/kde/include/netwm.h:826: `Bool' was not declared in this scope
/opt/kde/include/netwm.h:826: parse error before `)' token
/opt/kde/include/netwm.h:833: `Window' was not declared in this scope
/opt/kde/include/netwm.h:833: parse error before `)' token
make[4]: *** [kvi_app.o] Error 1
make[4]: Leaving directory `/home/spot/kvirc-3.0.0-beta2/src/kvirc/build'
make[3]: *** [all-recursive] Error 1
make[3]: Leaving directory `/home/spot/kvirc-3.0.0-beta2/src/kvirc'
make[2]: *** [all-recursive] Error 1
make[2]: Leaving directory `/home/spot/kvirc-3.0.0-beta2/src'
make[1]: *** [all] Error 2
make[1]: Leaving directory `/home/spot/kvirc-3.0.0-beta2/src'
make: *** [all-recursive] Error 1
...
/opt/kde/include/netwm.h:536: syntax error before `{' token
/opt/kde/include/netwm.h:545: `Window' was not declared in this scope
/opt/kde/include/netwm.h:545: virtual outside class declaration
/opt/kde/include/netwm.h:545: variable or field `closeWindow' declared void
/opt/kde/include/netwm.h:545: syntax error before `{' token
/opt/kde/include/netwm.h:562: `Window' was not declared in this scope
/opt/kde/include/netwm.h:562: parse error before `,' token
/opt/kde/include/netwm.h:562: virtual outside class declaration
/opt/kde/include/netwm.h:565: parse error before `private'
/opt/kde/include/netwm.h:568: 'Role' is used as a type, but is not defined as a
type.
/opt/kde/include/netwm.h:570: parse error before `protected'
/opt/kde/include/netwm.h:610: type specifier omitted for parameter `Window'
/opt/kde/include/netwm.h:610: parse error before `,' token
/opt/kde/include/netwm.h:714: parse error before `)' token
/opt/kde/include/netwm.h:722: parse error before `)' token
/opt/kde/include/netwm.h:741: type specifier omitted for parameter `Bool'
/opt/kde/include/netwm.h:741: parse error before `=' token
/opt/kde/include/netwm.h:826: `Bool' was not declared in this scope
/opt/kde/include/netwm.h:826: parse error before `)' token
/opt/kde/include/netwm.h:833: `Window' was not declared in this scope
/opt/kde/include/netwm.h:833: parse error before `)' token
make[4]: *** [kvi_app.o] Error 1
make[4]: Leaving directory `/home/spot/kvirc-3.0.0-beta2/src/kvirc/build'
make[3]: *** [all-recursive] Error 1
make[3]: Leaving directory `/home/spot/kvirc-3.0.0-beta2/src/kvirc'
make[2]: *** [all-recursive] Error 1
make[2]: Leaving directory `/home/spot/kvirc-3.0.0-beta2/src'
make[1]: *** [all] Error 2
make[1]: Leaving directory `/home/spot/kvirc-3.0.0-beta2/src'
make: *** [all-recursive] Error 1
Re: Slackware 9.0 - errors
Повечето грешки са от неинсталирани devel пакети. Не мога да ти кажа как да си ги инсталираш, защото не съм със Slack.
Това там за -lXinerama сигурно ще се оправи, ако при ./configure му дадеш --disable-xinerama или там която опция прави това за тази програма. Напиши ./configure --help за да я видиш коя е.
Това там за -lXinerama сигурно ще се оправи, ако при ./configure му дадеш --disable-xinerama или там която опция прави това за тази програма. Напиши ./configure --help за да я видиш коя е.
Re: Slackware 9.0 - errors
xinerama май винаги е дисейбъл. има опция --with-xinerama , с която май се включва, но не и да се изключва.
а иначе няма ли някои друг да каже за другите грешки
а иначе няма ли някои друг да каже за другите грешки
Re: Slackware 9.0 - errors
sloji si devel paketite na XFree86, ako gi niamash na pyrvia disk, vij na vtoria
ako li ne, [линк] ili site na XFree
ako li ne, [линк] ili site na XFree
Re: Не мога да ти помогна :-)
Още не съм се докопал до Slackware 9.0 , но и на предишните Slackware съм се сблъсквал с подобни проблеми.
То ако беше лесно всички щяха да са на Slack !
.
Не се отказвай ! Изтегли development пакетите, които ти иска.
Разгледай дали при компилация случайно няма припокриващи се декларации на функции в header фаиловете.
То ако беше лесно всички щяха да са на Slack !
Не се отказвай ! Изтегли development пакетите, които ти иска.
Разгледай дали при компилация случайно няма припокриващи се декларации на функции в header фаиловете.
Re: Slackware 9.0 - errors
Обратната на --with-PACKAGE е --without-PACKAGE. А иначе е възможно и някоя библиотека да е компилирана с --with-xinerama и затова да се бута тука.
Re: Slackware 9.0 - errors
слака ми е на 1 един диск .
най - странното е че инсталирах x-devel oт /slackware/x на диска на Slackware 9.0, но без резултат :(
според мене това трябва да са пакетите които ми трябват.
все пак ще потърся и други.
най - странното е че инсталирах x-devel oт /slackware/x на диска на Slackware 9.0, но без резултат :(
според мене това трябва да са пакетите които ми трябват.
все пак ще потърся и други.