GConf-1.2.1
0 отговора
28 прегледа
GConf-1.2.1
>Някой инсталирал ли е GConf-1.2.1 или по-стар? Не разбирам какъв му е проблема? Дава ми следната грешка при make:
*** Scanning header files ***
if grep -l '^..*$' ./gconf.types > /dev/null ; then \
CC="/bin/sh ../../libtool --mode=compile gcc" LD="/bin/sh ../../libtool --mode=link gcc" CFLAGS="-I../.. -g -O2 -Wall -DORBIT2=1 -I/usr/include/glib-2.0 -I/usr/lib/glib-2.0/include -I/usr/include/orbit-2.0 -I/usr/local/include/linc-1.0 " LDFLAGS=" -Wl,--export-dynamic -Wl,--export-dynamic -L/usr/local/lib -lORBit-2 -lm -lgmodule-2.0 -ldl -llinc -lgobject-2.0 -lgthread-2.0 -lpthread -lglib-2.0 ../../gconf/libgconf-2.la" gtkdoc-scangobj --module=gconf --output-dir=. --nogtkinit; \
else \
cd . ; \
for i in gconf.args gconf.hierarchy gconf.signals ; do \
test -f $i || touch $i ; \
done \
fi
rm -f .libs/gconf-scan.lo
gcc -I../.. -g -O2 -Wall -DORBIT2=1 -I/usr/include/glib-2.0 -I/usr/lib/glib-2.0/include -I/usr/include/orbit-2.0 -I/usr/local/include/linc-1.0 -c gconf-scan.c -fPIC -DPIC -o .libs/gconf-scan.lo
gconf-scan.c: In function `main':
gconf-scan.c:60: too many arguments to function `g_type_init'
gconf-scan.c: In function `output_widget_args':
gconf-scan.c:661: structure has no member named `n_property_specs'
gconf-scan.c:663: structure has no member named `property_specs'
Compilation of scanner failed
make[3]: *** [scan-build.stamp] Error 1
make[3]: Leaving directory `/GConf-1.2.1/doc/gconf'
make[2]: *** [all-recursive] Error 1
make[2]: Leaving directory `/GConf-1.2.1/doc'
make[1]: *** [all-recursive] Error 1
make[1]: Leaving directory `/GConf-1.2.1'
make: *** [all-recursive-am] Error 2
Какво да правя? Мерси!
*** Scanning header files ***
if grep -l '^..*$' ./gconf.types > /dev/null ; then \
CC="/bin/sh ../../libtool --mode=compile gcc" LD="/bin/sh ../../libtool --mode=link gcc" CFLAGS="-I../.. -g -O2 -Wall -DORBIT2=1 -I/usr/include/glib-2.0 -I/usr/lib/glib-2.0/include -I/usr/include/orbit-2.0 -I/usr/local/include/linc-1.0 " LDFLAGS=" -Wl,--export-dynamic -Wl,--export-dynamic -L/usr/local/lib -lORBit-2 -lm -lgmodule-2.0 -ldl -llinc -lgobject-2.0 -lgthread-2.0 -lpthread -lglib-2.0 ../../gconf/libgconf-2.la" gtkdoc-scangobj --module=gconf --output-dir=. --nogtkinit; \
else \
cd . ; \
for i in gconf.args gconf.hierarchy gconf.signals ; do \
test -f $i || touch $i ; \
done \
fi
rm -f .libs/gconf-scan.lo
gcc -I../.. -g -O2 -Wall -DORBIT2=1 -I/usr/include/glib-2.0 -I/usr/lib/glib-2.0/include -I/usr/include/orbit-2.0 -I/usr/local/include/linc-1.0 -c gconf-scan.c -fPIC -DPIC -o .libs/gconf-scan.lo
gconf-scan.c: In function `main':
gconf-scan.c:60: too many arguments to function `g_type_init'
gconf-scan.c: In function `output_widget_args':
gconf-scan.c:661: structure has no member named `n_property_specs'
gconf-scan.c:663: structure has no member named `property_specs'
Compilation of scanner failed
make[3]: *** [scan-build.stamp] Error 1
make[3]: Leaving directory `/GConf-1.2.1/doc/gconf'
make[2]: *** [all-recursive] Error 1
make[2]: Leaving directory `/GConf-1.2.1/doc'
make[1]: *** [all-recursive] Error 1
make[1]: Leaving directory `/GConf-1.2.1'
make: *** [all-recursive-am] Error 2
Какво да правя? Мерси!